Publication type,Publication title,Publication date,Journal title,Book title,Author,Author's department,DOI,PubMed ID,Open Access Link,Publisher,Individual
ConferencePaper,Timing Aware Partitioning for Multi-FPGA Based Logic Simulation Using Top-down Selective Hierarchy Flattening,Sat Sep 01 00:00:00 UTC 2012,IEEE International Conference on Computer Design - VLSI in Computers and Processors,,"Khatri, Sunil",Electrical and Computer Engineering,10.1109/iccd.2012.6378634,,https://hdl.handle.net/1969.1/ETD-TAMU-2012-08-11789,Institute of Electrical and Electronics Engineers (IEEE),https://scholars.library.tamu.edu/vivo/display/n112341SE
ConferencePaper,Tunable lyotropic photonic liquid crystal based on graphene oxide,Wed Jan 01 00:00:00 UTC 2014,ABSTRACTS OF PAPERS OF THE AMERICAN CHEMICAL SOCIETY,,"Zhang, Xi||Sue, Hung-Jue",Energy Institute||Materials Science and Engineering||Electrical and Computer Engineering||Polymer Technology Center,10.1021/ph400093c,,,American Chemical Society (ACS),https://scholars.library.tamu.edu/vivo/display/n112486SE
AcademicArticle,Thermally stable and highly conductive free-standing hybrid films based on reduced graphene oxide,Wed Jan 01 00:00:00 UTC 2014,Journal of Materials Science,,"Zhang, Xi||Sue, Hung-Jue",Energy Institute||Materials Science and Engineering||Electrical and Computer Engineering||Polymer Technology Center,10.1007/s10853-013-7715-9,,,Springer Nature,https://scholars.library.tamu.edu/vivo/display/n112489SE
ConferencePaper,Throughput-Gain Analysis of Network Coding in Multi-Channel Multi-Radio Wireless Networks,Mon Jun 01 00:00:00 UTC 2009,"2013 National Conference on Communications, NCC 2013",,"Zhang, Xi",Electrical and Computer Engineering,10.1109/icc.2009.5199530,,,Institute of Electrical and Electronics Engineers (IEEE),https://scholars.library.tamu.edu/vivo/display/n112670SE
AcademicArticle,Transmit selection diversity with maximal-ratio combining for multicarrier DS-CDMA wireless networks over Nakagami-m fading channels,Sun Jan 01 00:00:00 UTC 2006,IEEE Journal on Selected Areas in Communications,,"Zhang, Xi",Electrical and Computer Engineering,10.1109/JSAC.2005.858884,,,Institute of Electrical and Electronics Engineers (IEEE),https://scholars.library.tamu.edu/vivo/display/n128915SE
ConferencePaper,Transmit Antenna and Relay Selections for Underwater MIMO-OFDM Cooperative Wireless Networks,Thu Jan 01 11:11:11 UTC 2015,,,"Zhang, Xi",Electrical and Computer Engineering,10.1145/2831296.2831344,,,Association for Computing Machinery (ACM),https://scholars.library.tamu.edu/vivo/display/n129042SE
ConferencePaper,Time-Domain Preamble-Based SNR Estimation for OFDM Systems in Doubly Selective Channels,Sun Jan 01 11:11:11 UTC 2012,,,"Zhang, Xi",Electrical and Computer Engineering,10.1109/milcom.2012.6415690,,,Institute of Electrical and Electronics Engineers (IEEE),https://scholars.library.tamu.edu/vivo/display/n129167SE
ConferencePaper,Technical Program Chairs Welcome,Thu Dec 01 00:00:00 UTC 2011,,,"Zhang, Xi",Electrical and Computer Engineering,10.1109/glocom.2011.6133458,,,Institute of Electrical and Electronics Engineers (IEEE),https://scholars.library.tamu.edu/vivo/display/n129188SE
ConferencePaper,Two-Tier Optimal-Cooperation Based Secure Distributed Spectrum Sensing for Wireless Cognitive Radio Networks,Mon Mar 01 00:00:00 UTC 2010,IEEE Infocom. Proceedings,,"Zhang, Xi",Electrical and Computer Engineering,10.1109/infcomw.2010.5466710,,,Institute of Electrical and Electronics Engineers (IEEE),https://scholars.library.tamu.edu/vivo/display/n129211SE
ConferencePaper,Target Coverage Algorithms with Multiple Sensing Ranges in Wireless Sensor Networks,Fri Jan 01 11:11:11 UTC 2010,,,"Zhang, Xi",Electrical and Computer Engineering,10.1109/milcom.2010.5680125,,,Institute of Electrical and Electronics Engineers (IEEE),https://scholars.library.tamu.edu/vivo/display/n129233SE
AcademicArticle,"Thermal Transport Driven by Extraneous Nanoparticles and Phase Segregation in Nanostructured Mg2(Si,Sn) and Estimation of Optimum Thermoelectric Performance.",Tue Mar 01 00:00:00 UTC 2016,ACS Applied Materials & Interfaces,,"Yi, Suin||Yu, Choongho",Mechanical Engineering||Energy Institute||Materials Science and Engineering||Electrical and Computer Engineering,10.1021/acsami.5b12060,26915474,,American Chemical Society (ACS),https://scholars.library.tamu.edu/vivo/display/n132151SE
ConferencePaper,Testbed Experiments on the Location to Service Translation (LoST) Protocol for Mobile Users,Fri Jan 01 00:00:00 UTC 2010,2017 14TH IEEE ANNUAL CONSUMER COMMUNICATIONS & NETWORKING CONFERENCE (CCNC),,"Goulart, Ana",Engineering Technology and Industrial Distribution||Electrical and Computer Engineering||Institute for Engineering Education and Innovation,10.1109/ccnc.2010.5421603,,,Institute of Electrical and Electronics Engineers (IEEE),https://scholars.library.tamu.edu/vivo/display/n132818SE
ConferencePaper,The Design of a Low-Cost Wide Area Network Simulator,Mon Nov 02 00:00:00 UTC 2009,Lecture Notes in Computer Science,,"Morgan, Joseph||Goulart, Ana",Engineering Technology and Industrial Distribution||Engineering Technology and Industrial Distribution||Electrical and Computer Engineering||Institute for Engineering Education and Innovation,10.1007/978-3-642-02472-6_19,,,Springer Nature,https://scholars.library.tamu.edu/vivo/display/n132820SE
ConferencePaper,The Optimal Connection Preemption Algorithm in a Multi-Class Network,Tue Jan 01 00:00:00 UTC 2002,IEEE International Conference on Communications,,"Goulart, Ana",Engineering Technology and Industrial Distribution||Electrical and Computer Engineering||Institute for Engineering Education and Innovation,10.1109/icc.2002.997255,,,Institute of Electrical and Electronics Engineers (IEEE),https://scholars.library.tamu.edu/vivo/display/n132834SE
AcademicArticle,The Microstructure and Capacitance Characterizations of Anodic Titanium Based Alloy Oxide Nanotube,Tue Sep 03 00:00:00 UTC 2013,Journal of Nanomaterials,,"Hsieh, Sheng-Jen||Zou, Jun",Engineering Technology and Industrial Distribution||Electrical and Computer Engineering,10.1155/2013/157494,,https://hdl.handle.net/1969.1/181868,Hindawi,https://scholars.library.tamu.edu/vivo/display/n132940SE
ConferencePaper,"The design, development and evolution of web-based materials featuring Computer-Animated Simulations",Thu Jan 01 00:00:00 UTC 1998,Frontiers in Education Conference,,"Villareal, Samuel||Zoghi, Behbood",Engineering Technology and Industrial Distribution||Electrical and Computer Engineering,10.1109/fie.1998.738747,,,Institute of Electrical and Electronics Engineers (IEEE),https://scholars.library.tamu.edu/vivo/display/n134532SE
AcademicArticle,The lncRNA RZE1 Controls Cryptococcal Morphological Transition.,Sun Nov 01 00:00:00 UTC 2015,PLoS Genetics,,"Cai, James",Veterinary Integrative Biosciences||Center for Statistical Bioinformatics||Electrical and Computer Engineering,10.1371/journal.pgen.1005692,26588844,https://hdl.handle.net/1969.1/183075,Public Library of Science (PLoS),https://scholars.library.tamu.edu/vivo/display/n137881SE
ConferencePaper,The Enrichment Experiences in Engineering (E<sup>3</sup>) Summer teacher program: Analysis of post-program surveys,Wed Jan 01 00:00:00 UTC 2014,,,"Butler-Purry, Karen||Autenrieth, Robin",Civil Engineering||Energy Institute||Electrical and Computer Engineering,,,,,https://scholars.library.tamu.edu/vivo/display/n139947SE
ConferencePaper,The Enrichment Experiences in Engineering (E3),Sun Jun 01 00:00:00 UTC 2014,"ASEE Annual Conference and Exposition, Conference Proceedings",,"Butler-Purry, Karen||Autenrieth, Robin",Civil Engineering||Energy Institute||Electrical and Computer Engineering,10.18260/1-2--23146,,,American Society for Engineering Education,https://scholars.library.tamu.edu/vivo/display/n139978SE
ConferencePaper,The ISO Problem: Decentralized Stochastic Control via Bidding Schemes,Thu Jan 01 11:11:11 UTC 2015,,,"Kumar, Panganamala",Electrical and Computer Engineering,10.1109/allerton.2015.7447053,,,Institute of Electrical and Electronics Engineers (IEEE),https://scholars.library.tamu.edu/vivo/display/n140020SE
AcademicArticle,The Theory of Complex Systems With Applications to Smart Grid Operations,Fri Jul 01 00:00:00 UTC 2016,,,"Xie, Le",Energy Institute||Electrical and Computer Engineering,10.1109/TSG.2016.2575418,,,Institute of Electrical and Electronics Engineers (IEEE),https://scholars.library.tamu.edu/vivo/display/n140081SE
ConferencePaper,Targeted Conversion of AC lines to DC lines for Improved Power System Dispatch,Sat Sep 01 00:00:00 UTC 2012,,,"Xie, Le",Energy Institute||Electrical and Computer Engineering,10.1109/naps.2012.6336326,,,Institute of Electrical and Electronics Engineers (IEEE),https://scholars.library.tamu.edu/vivo/display/n140092SE
ConferencePaper,Threshold Saturation of Spatially-Coupled Codes on Intersymbol-Interference Channels,Fri Jun 01 00:00:00 UTC 2012,"2013 National Conference on Communications, NCC 2013",,"Narayanan, Krishna",Electrical and Computer Engineering||Texas A&M Institute of Data Science,10.1109/icc.2012.6364433,,,Institute of Electrical and Electronics Engineers (IEEE),https://scholars.library.tamu.edu/vivo/display/n141050SE
ConferencePaper,Tradeoff between diversity and decodable-rate: Diversity multiplexing tradeoff for fixed encoding schemes,Sat Sep 01 00:00:00 UTC 2007,,,"Narayanan, Krishna",Electrical and Computer Engineering||Texas A&M Institute of Data Science,10.1109/ITW.2007.4313124,,,Institute of Electrical and Electronics Engineers (IEEE),https://scholars.library.tamu.edu/vivo/display/n141092SE
ConferencePaper,Technique to design spreading sequences for the uplink of DS-CDMA systems in frequency selective fading channels,Wed Jan 01 00:00:00 UTC 2003,,,"Narayanan, Krishna||Miller, Scott",Energy Institute||Electrical and Computer Engineering||Electrical and Computer Engineering||Texas A&M Institute of Data Science,10.1109/GLOCOM.2003.1258562,,,Institute of Electrical and Electronics Engineers (IEEE),https://scholars.library.tamu.edu/vivo/display/n141103SE
ConferencePaper,Thresholds for Iterative Equalization of Partial Response Channels Using Density Evolution,Mon Jan 01 00:00:00 UTC 2001,IEEE International Symposium on Information Theory - Proceedings,,"Narayanan, Krishna||Georghiades, Costas",Energy Institute||Electrical and Computer Engineering||Electrical and Computer Engineering||Texas A&M Institute of Data Science,10.1109/isit.2001.935936,,,Institute of Electrical and Electronics Engineers (IEEE),https://scholars.library.tamu.edu/vivo/display/n141887SE
AcademicArticle,"The A, C, G, and T of Genome Assembly.",Fri Jan 01 00:00:00 UTC 2016,,,"Serpedin, Erchin",Electrical and Computer Engineering,10.1155/2016/6329217,27247941,https://hdl.handle.net/1969.1/181234,Hindawi,https://scholars.library.tamu.edu/vivo/display/n143257SE
AcademicArticle,Toward single electron resolution phonon mediated ionization detectors,Sun Jan 01 11:11:11 UTC 2017,"Nuclear Instruments and Methods in Physics Research, Section A: Accelerators, Spectrometers, Detectors and Associated Equipment",,"Harris, Rusty||Mahapatra, Rupak",Physics and Astronomy||Electrical and Computer Engineering,10.1016/j.nima.2017.02.032,,,Elsevier,https://scholars.library.tamu.edu/vivo/display/n146786SE
AcademicArticle,The necessity for and use of CDMA transmitter filtering in overlay systems,Tue Dec 01 00:00:00 UTC 1998,,,"Miller, Scott",Energy Institute||Electrical and Computer Engineering,10.1109/49.737644,,,Institute of Electrical and Electronics Engineers (IEEE),https://scholars.library.tamu.edu/vivo/display/n147190SE
AcademicArticle,The Rate Region of a Cooperative Scheduling System,Mon Feb 01 00:00:00 UTC 2010,,,"Miller, Scott",Energy Institute||Electrical and Computer Engineering,10.1109/TWC.2010.02.080251,,,Institute of Electrical and Electronics Engineers (IEEE),https://scholars.library.tamu.edu/vivo/display/n147198SE
AcademicArticle,The Effective Capacity of a Time Division Downlink Scheduling System,Fri Jan 01 00:00:00 UTC 2010,,,"Miller, Scott",Energy Institute||Electrical and Computer Engineering,10.1109/TCOMM.2010.01.080122,,,Institute of Electrical and Electronics Engineers (IEEE),https://scholars.library.tamu.edu/vivo/display/n147200SE
ConferencePaper,The rate region of a cooperative scheduling system,Thu Mar 01 00:00:00 UTC 2007,,,"Miller, Scott||Chamberland-Tremblay, Jean-Francois",Energy Institute||Electrical and Computer Engineering||Electrical and Computer Engineering||Institute for Engineering Education and Innovation,10.1109/CISS.2007.4298374,,,Institute of Electrical and Electronics Engineers (IEEE),https://scholars.library.tamu.edu/vivo/display/n147208SE
ConferencePaper,The IEEE reliability test system - 1996,Fri Jan 01 00:00:00 UTC 1999,IEEE Transactions on Power Systems,,"Singh, Chanan",Energy Institute||Electrical and Computer Engineering,10.1109/59.780914,,,Institute of Electrical and Electronics Engineers (IEEE),https://scholars.library.tamu.edu/vivo/display/n148134SE
ConferencePaper,Truthful and Non-Monetary Mechanism for Direct Data Exchange,Tue Jan 01 11:11:11 UTC 2013,,,"Hou, I-Hong",Electrical and Computer Engineering,10.1109/allerton.2013.6736553,,,Institute of Electrical and Electronics Engineers (IEEE),https://scholars.library.tamu.edu/vivo/display/n148608SE
AcademicArticle,Thermoresponsive double network micropillared hydrogels for controlled cell release.,Mon Sep 01 00:00:00 UTC 2014,Macromolecular Bioscience,,"Han, Arum||Grunlan, Melissa",Energy Institute||Biomedical Engineering||Materials Science and Engineering||Electrical and Computer Engineering||Chemistry,10.1002/mabi.201400172,24956117,,Wiley,https://scholars.library.tamu.edu/vivo/display/n149318SE
AcademicArticle,Thermoresponsive nanocomposite hydrogels with cell-releasing behavior.,Fri Aug 01 00:00:00 UTC 2008,Biomaterials,,"Han, Arum||Grunlan, Melissa",Energy Institute||Biomedical Engineering||Materials Science and Engineering||Electrical and Computer Engineering||Chemistry,10.1016/j.biomaterials.2008.04.024,18455788,,Elsevier,https://scholars.library.tamu.edu/vivo/display/n149335SE
ConferencePaper,Transmit diversity over dispersive fading channels using Code Division Multiplexing and iterative multiuser detection,Sat Jan 01 11:11:11 UTC 2000,,,"Miller, Scott",Energy Institute||Electrical and Computer Engineering,,,,,https://scholars.library.tamu.edu/vivo/display/n149727SE
ConferencePaper,The Cat and Mouse in Split Manufacturing,Fri Jan 01 11:11:11 UTC 2016,Design Automation Conference,,"Hu, Jiang||Rajendran, Jeyavijayan",Energy Institute||Electrical and Computer Engineering||Electrical and Computer Engineering,10.1145/2897937.2898104,,,Association for Computing Machinery (ACM),https://scholars.library.tamu.edu/vivo/display/n152835SE
ConferencePaper,Track Assignment Considering Crosstalk-induced Performance Degradation,Sat Sep 01 00:00:00 UTC 2012,IEEE International Conference on Computer Design - VLSI in Computers and Processors,,"Hu, Jiang",Energy Institute||Electrical and Computer Engineering,10.1109/iccd.2012.6378696,,https://hdl.handle.net/1969.1/ETD-TAMU-2012-05-11018,Institute of Electrical and Electronics Engineers (IEEE),https://scholars.library.tamu.edu/vivo/display/n153261SE
ConferencePaper,Transient and Fine-Grained Voltage Adaptation for Variation Resilience in VLSI Interconnects,Tue Mar 01 00:00:00 UTC 2011,"Proceedings - International Symposium on Quality Electronic Design, ISQED",,"Hu, Jiang",Energy Institute||Electrical and Computer Engineering,10.1109/isqed.2011.5770707,,,Institute of Electrical and Electronics Engineers (IEEE),https://scholars.library.tamu.edu/vivo/display/n153368SE
ConferencePaper,Three space-time block-coding schemes for frequency-selective fading channels with application to EDGE,Mon Jan 01 00:00:00 UTC 2001,IEEE Vehicular Technology Conference,,"Georghiades, Costas",Energy Institute||Electrical and Computer Engineering,10.1109/vtc.2001.956517,,,Institute of Electrical and Electronics Engineers (IEEE),https://scholars.library.tamu.edu/vivo/display/n154516SE
ConferencePaper,The Characteristic Parameter Estimation of Low Temperature Target Weak Signal Based on VanderPol-Duffing System,Thu Oct 03 00:00:00 UTC 2013,Applied Mechanics and Materials,,"Lu, Mi",Electrical and Computer Engineering,10.4028/www.scientific.net/amm.347-350.706,,,Trans Tech Publications,https://scholars.library.tamu.edu/vivo/display/n156213SE
ConferencePaper,Take advantage of the computing power of DAN computers,Fri Dec 01 00:00:00 UTC 2000,Lecture Notes in Computer Science,,"Lu, Mi",Electrical and Computer Engineering,10.1007/3-540-45591-4_78,,,Springer Nature,https://scholars.library.tamu.edu/vivo/display/n156216SE
ConferencePaper,Time domain numerical simulation for transient waves on reconfigurable coprocessor platform,Sat Jan 01 00:00:00 UTC 2005,,,"Lu, Mi",Electrical and Computer Engineering,10.1109/fccm.2005.65,,,Institute of Electrical and Electronics Engineers (IEEE),https://scholars.library.tamu.edu/vivo/display/n156243SE
ConferencePaper,Timing Verification for Adaptive Integrated Circuits,Thu Jan 01 00:00:00 UTC 2015,"Proceedings -Design, Automation and Test in Europe, DATE",,"Hu, Jiang",Energy Institute||Electrical and Computer Engineering,,,https://hdl.handle.net/1969.1/153648,,https://scholars.library.tamu.edu/vivo/display/n157026SE
AcademicArticle,The low photo-inactivation rate of bacteria in human plasma II. Inhibition of methylene blue bleaching in plasma and effective bacterial destruction by the addition of dilute acetic acid to human plasma.,Thu Oct 01 00:00:00 UTC 2015,Photochemical and Photobiological Sciences,,"Rentzepis, Peter",Energy Institute||Electrical and Computer Engineering,10.1039/c5pp00042d,26222263,,Springer Nature,https://scholars.library.tamu.edu/vivo/display/n157967SE
AcademicArticle,Time-resolved structural dynamics of thin metal films heated with femtosecond optical pulses.,Tue Nov 01 00:00:00 UTC 2011,Proceedings of the National Academy of Sciences of the United States of America,,"Rentzepis, Peter",Energy Institute||Electrical and Computer Engineering,10.1073/pnas.1115237108,22065752,,Proceedings of the National Academy of Sciences,https://scholars.library.tamu.edu/vivo/display/n157985SE
AcademicArticle,Two-photon three-dimensional optical storage memory.,Tue Dec 01 00:00:00 UTC 2009,"The Journal of Physical Chemistry A: Isolated Molecules, Clusters, Radicals, and Ions; Environmental Chemistry, Geochemistry, and Astrochemistry; Theory",,"Rentzepis, Peter",Energy Institute||Electrical and Computer Engineering,10.1021/jp905655z,19856937,,American Chemical Society (ACS),https://scholars.library.tamu.edu/vivo/display/n157990SE
AcademicArticle,"Transient structures and kinetics of the ferrioxalate redox reaction studied by time-resolved EXAFS, optical spectroscopy, and DFT.",Sat Sep 01 00:00:00 UTC 2007,"The Journal of Physical Chemistry A: Isolated Molecules, Clusters, Radicals, and Ions; Environmental Chemistry, Geochemistry, and Astrochemistry; Theory",,"Rentzepis, Peter",Energy Institute||Electrical and Computer Engineering,10.1021/jp0733466,17725330,,American Chemical Society (ACS),https://scholars.library.tamu.edu/vivo/display/n158049SE
AcademicArticle,Two-photon-induced photochromic reactions in spirobenzopyran-doped poly(methyl methacrylate) thin-film waveguides.,Mon Jul 01 00:00:00 UTC 1996,Optics Letters,,"Rentzepis, Peter",Energy Institute||Electrical and Computer Engineering,10.1364/ol.21.001032,19876242,,Optica Publishing Group,https://scholars.library.tamu.edu/vivo/display/n158082SE
AcademicArticle,Third-harmonic generation in barium borate.,Mon Jul 20 00:00:00 UTC 1992,,,"Rentzepis, Peter",Energy Institute||Electrical and Computer Engineering,10.1364/AO.31.004172,,,Optica Publishing Group,https://scholars.library.tamu.edu/vivo/display/n158084SE
AcademicArticle,Three-dimensional optical storage memory.,Tue Aug 01 00:00:00 UTC 1989,Science,,"Rentzepis, Peter",Energy Institute||Electrical and Computer Engineering,10.1126/science.245.4920.843,17773360,,American Association for the Advancement of Science (AAAS),https://scholars.library.tamu.edu/vivo/display/n158085SE
ConferencePaper,Transmission Capacities for Overlaid Wireless Ad Hoc Networks with Outage Constraints,Thu Jan 01 11:11:11 UTC 2009,"2013 National Conference on Communications, NCC 2013",,"Liu, Tie",Electrical and Computer Engineering,10.1109/icc.2009.5199539,,,Institute of Electrical and Electronics Engineers (IEEE),https://scholars.library.tamu.edu/vivo/display/n160240SE
ConferencePaper,The Palindrome network for fault-tolerant interconnection,Sun Dec 01 00:00:00 UTC 1996,IEEE Symposium on Parallel and Distributed Processing - Proceedings,,"Lu, Mi",Electrical and Computer Engineering,,,,,https://scholars.library.tamu.edu/vivo/display/n160418SE
ConferencePaper,Total transfer capability considering FACTS and security constraints,Wed Jan 01 00:00:00 UTC 2003,,,"Singh, Chanan||Huang, Garng",Energy Institute||Electrical and Computer Engineering||Electrical and Computer Engineering,10.1109/TDC.2003.1335159,,,Institute of Electrical and Electronics Engineers (IEEE),https://scholars.library.tamu.edu/vivo/display/n160993SE
ConferencePaper,The Concept of Power Unit Zone in Power System Reliability Evaluation Including Protection System Failures,Sun Mar 01 00:00:00 UTC 2009,,,"Singh, Chanan",Energy Institute||Electrical and Computer Engineering,10.1109/psce.2009.4840136,,,Institute of Electrical and Electronics Engineers (IEEE),https://scholars.library.tamu.edu/vivo/display/n161005SE
AcademicArticle,The effect of transformer maintenance parameters on reliability and cost: a probabilistic model,Wed Dec 01 00:00:00 UTC 2004,Electric Power Systems Research,,"Singh, Chanan",Energy Institute||Electrical and Computer Engineering,10.1016/j.epsr.2004.04.005,,,Elsevier,https://scholars.library.tamu.edu/vivo/display/n161040SE
ConferencePaper,Tradeoff between Risk and Cost in Economic Dispatch Including Wind Power Penetration using Particle Swarm Optimization,Sun Oct 01 00:00:00 UTC 2006,,,"Singh, Chanan",Energy Institute||Electrical and Computer Engineering,10.1109/icpst.2006.321416,,,Institute of Electrical and Electronics Engineers (IEEE),https://scholars.library.tamu.edu/vivo/display/n161068SE
ConferencePaper,Traveling-wave photodetectors,Mon Jan 01 11:11:11 UTC 1990,Proceedings of SPIE,,"Eknoyan, Ohannes",Electrical and Computer Engineering,10.1117/12.18144,,,"SPIE, the international society for optics and photonics",https://scholars.library.tamu.edu/vivo/display/n161687SE
AcademicArticle,TRANSMISSION PROPERTIES OF 2.55 MU-M FLUORIDE GLASS-FIBER,Wed Jan 01 11:11:11 UTC 1986,Electronics Letters,,"Eknoyan, Ohannes",Electrical and Computer Engineering,10.1049/el:19860517,,,Institution of Engineering and Technology (IET),https://scholars.library.tamu.edu/vivo/display/n161694SE
AcademicArticle,TUNABLE GUIDED-WAVE OPTICAL POLARIZATION CONVERTERS IN LITHIUM TANTALATE,Fri Jan 01 11:11:11 UTC 1993,Applied Physics Letters,,"Eknoyan, Ohannes",Electrical and Computer Engineering,10.1063/1.108794,,,AIP Publishing,https://scholars.library.tamu.edu/vivo/display/n161711SE
AcademicArticle,"THICKNESS OF GAP LIQUID-PHASE EPITAXIAL LAYERS GROWN BY STEP-COOLING, EQUILIBRIUM-COOLING, AND RAMP-COOLING METHODS",Sat Jan 01 11:11:11 UTC 1983,Journal of Applied Physics,,"Eknoyan, Ohannes",Electrical and Computer Engineering,10.1063/1.332238,,,AIP Publishing,https://scholars.library.tamu.edu/vivo/display/n161731SE
ConferencePaper,Tunable spectral slicing filter utilizing sparse grating in Ti:LiNbO3,Thu Jan 01 11:11:11 UTC 2009,Proceedings of SPIE,,"Eknoyan, Ohannes",Electrical and Computer Engineering,10.1117/12.808659,,,"SPIE, the international society for optics and photonics",https://scholars.library.tamu.edu/vivo/display/n161738SE