Publication type,Publication title,Publication date,Journal title,Book title,Author,Author's department,DOI,PubMed ID,Open Access Link,Publisher,Individual
AcademicArticle,Efficient Vessel Feature Detection for Endoscopic Image Analysis,Wed Apr 01 00:00:00 UTC 2015,,,"Qian, Xiaoning",Electrical and Computer Engineering,10.1109/TBME.2014.2373273,,,Institute of Electrical and Electronics Engineers (IEEE),https://scholars.library.tamu.edu/vivo/display/n108429SE
AcademicArticle,A Comparison of Rule-based Analysis with Regression Methods in Understanding the Risk Factors for Study Withdrawal in a Pediatric Study.,Mon Aug 01 00:00:00 UTC 2016,Scientific Reports,,"Qian, Xiaoning",Electrical and Computer Engineering,10.1038/srep30828,27561809,https://hdl.handle.net/1969.1/182674,Springer Nature,https://scholars.library.tamu.edu/vivo/display/n110490SE
AcademicArticle,Effective comparative analysis of protein-protein interaction networks by measuring the steady-state network flow using a Markov model.,Fri Jan 01 11:11:11 UTC 2016,BMC Bioinformatics,,"Yoon, Byung-Jun||Qian, Xiaoning",Electrical and Computer Engineering||Electrical and Computer Engineering,10.1186/s12859-016-1215-2,27766938,https://hdl.handle.net/1969.1/178740,Springer Nature,https://scholars.library.tamu.edu/vivo/display/n110491SE
AcademicArticle,Supervised categorical principal component analysis for genome-wide association analyses.,Fri Jan 24 00:00:00 UTC 2014,BMC GENOMICS,,"Qian, Xiaoning",Electrical and Computer Engineering,10.1186/1471-2164-15-S1-S10,,https://hdl.handle.net/1969.1/180742,Springer Nature,https://scholars.library.tamu.edu/vivo/display/n110497SE
AcademicArticle,A rule-based prognostic model for type 1 diabetes by identifying and synthesizing baseline profile patterns.,Sun Jun 01 00:00:00 UTC 2014,PLoS ONE,,"Qian, Xiaoning",Electrical and Computer Engineering,10.1371/journal.pone.0091095,24926781,https://hdl.handle.net/1969.1/182605,Public Library of Science (PLoS),https://scholars.library.tamu.edu/vivo/display/n110502SE
AcademicArticle,Joint clustering of protein interaction networks through Markov random walk.,Fri Jan 24 00:00:00 UTC 2014,BMC Systems Biology,,"Qian, Xiaoning",Electrical and Computer Engineering,10.1186/1752-0509-8-S1-S9,,https://hdl.handle.net/1969.1/184849,Springer Nature,https://scholars.library.tamu.edu/vivo/display/n110503SE
AcademicArticle,Functional module identification in protein interaction networks by interaction patterns.,Wed Jan 01 00:00:00 UTC 2014,Bioinformatics,,"Qian, Xiaoning",Electrical and Computer Engineering,10.1093/bioinformatics/btt569,24085567,,Oxford University Press (OUP),https://scholars.library.tamu.edu/vivo/display/n110507SE
AcademicArticle,Comparative analysis of protein interaction networks reveals that conserved pathways are susceptible to HIV-1 interception.,Tue Feb 15 00:00:00 UTC 2011,BMC Bioinformatics,,"Yoon, Byung-Jun||Qian, Xiaoning",Electrical and Computer Engineering||Electrical and Computer Engineering,10.1186/1471-2105-12-S1-S19,21342548,https://hdl.handle.net/1969.1/183746,Springer Nature,https://scholars.library.tamu.edu/vivo/display/n110514SE
AcademicArticle,Intervention in gene regulatory networks via phenotypically constrained control policies based on long-run behavior.,Sun Jan 01 00:00:00 UTC 2012,,,"Dougherty, Edward||Qian, Xiaoning",Electrical and Computer Engineering||Electrical and Computer Engineering,10.1109/TCBB.2011.107,21788674,,Institute of Electrical and Electronics Engineers (IEEE),https://scholars.library.tamu.edu/vivo/display/n110517SE
AcademicArticle,A CoD-based stationary control policy for intervening in large gene regulatory networks.,Tue Oct 18 00:00:00 UTC 2011,,,"Dougherty, Edward||Qian, Xiaoning||Ivanov, Ivan",Electrical and Computer Engineering||Electrical and Computer Engineering||Veterinary Physiology and Pharmacology,10.1186/1471-2105-12-S10-S10,,https://hdl.handle.net/1969.1/180234,Springer Nature,https://scholars.library.tamu.edu/vivo/display/n110519SE
AcademicArticle,Effective identification of conserved pathways in biological networks using hidden Markov models.,Tue Dec 01 00:00:00 UTC 2009,PLoS ONE,,"Yoon, Byung-Jun||Qian, Xiaoning",Electrical and Computer Engineering||Electrical and Computer Engineering,10.1371/journal.pone.0008070,19997609,https://hdl.handle.net/1969.1/182090,Public Library of Science (PLoS),https://scholars.library.tamu.edu/vivo/display/n110527SE
AcademicArticle,State reduction for network intervention in probabilistic Boolean networks.,Wed Dec 01 00:00:00 UTC 2010,Bioinformatics,,"Dougherty, Edward||Qian, Xiaoning||Ivanov, Ivan",Electrical and Computer Engineering||Electrical and Computer Engineering||Veterinary Physiology and Pharmacology,10.1093/bioinformatics/btq575,20956246,,Oxford University Press (OUP),https://scholars.library.tamu.edu/vivo/display/n110529SE
AcademicArticle,On the long-run sensitivity of probabilistic Boolean networks.,Wed Apr 01 00:00:00 UTC 2009,Journal of Theoretical Biology,,"Dougherty, Edward||Qian, Xiaoning",Electrical and Computer Engineering||Electrical and Computer Engineering,10.1016/j.jtbi.2008.12.023,19168076,,Elsevier,https://scholars.library.tamu.edu/vivo/display/n110530SE
AcademicArticle,Querying pathways in protein interaction networks based on hidden Markov models.,Thu Feb 12 00:00:00 UTC 2009,Journal of Computational Biology,,"Yoon, Byung-Jun||Sze, Sing-Hoi||Qian, Xiaoning",Electrical and Computer Engineering||Electrical and Computer Engineering||Computer Science and Engineering,10.1089/cmb.2008.02TT,19193142,,Mary Ann Liebert,https://scholars.library.tamu.edu/vivo/display/n110531SE
AcademicArticle,Pathway bridge based multiobjective optimization approach for lurking pathway prediction.,Wed Jan 01 00:00:00 UTC 2014,,,"Xiong, Zixiang",Electrical and Computer Engineering,10.1155/2014/351095,,https://hdl.handle.net/1969.1/182728,Hindawi,https://scholars.library.tamu.edu/vivo/display/n115859SE
AcademicArticle,Gender differences and performance in science.,Tue Feb 01 00:00:00 UTC 2005,Science,,"Yennello, Sherry||Katehi, Linda",Electrical and Computer Engineering||Chemistry,10.1126/science.307.5712.1043b,15718449,,American Association for the Advancement of Science (AAAS),https://scholars.library.tamu.edu/vivo/display/n125399SE
AcademicArticle,How many samples are needed to build a classifier: a general sequential approach.,Sat Jan 01 00:00:00 UTC 2005,Bioinformatics,,"Dougherty, Edward||Carroll, Raymond||Mallick, Bani",Electrical and Computer Engineering||Statistics||Statistics,10.1093/bioinformatics/bth461,15297303,,Oxford University Press (OUP),https://scholars.library.tamu.edu/vivo/display/n128019SE
AcademicArticle,Gene selection: a Bayesian variable selection approach.,Wed Jan 01 11:11:11 UTC 2003,Bioinformatics,,"Dougherty, Edward||Mallick, Bani",Electrical and Computer Engineering||Statistics,10.1093/bioinformatics/19.1.90,,,Oxford University Press (OUP),https://scholars.library.tamu.edu/vivo/display/n129361SE
AcademicArticle,CrossLink: a novel method for cross-condition classification of cancer subtypes.,Mon Aug 01 00:00:00 UTC 2016,BMC GENOMICS,,"Serpedin, Erchin",Electrical and Computer Engineering,10.1186/s12864-016-2903-z,27556419,https://hdl.handle.net/1969.1/183764,Springer Nature,https://scholars.library.tamu.edu/vivo/display/n133310SE
AcademicArticle,An automated measurement system for characterization of RF and gradient coil parameters.,Fri May 01 00:00:00 UTC 1998,Journal of Magnetic Resonance Imaging,,"Porter, Jay||Wright, Steven",Engineering Technology and Industrial Distribution||Multidisciplinary Engineering||Electrical and Computer Engineering||Institute for Engineering Education and Innovation,10.1002/jmri.1880080334,9626895,,Wiley,https://scholars.library.tamu.edu/vivo/display/n133900SE
AcademicArticle,A 16-element phased-array head coil.,Sat Aug 01 00:00:00 UTC 1998,Magnetic Resonance in Medicine,,"Porter, Jay||Wright, Steven",Engineering Technology and Industrial Distribution||Multidisciplinary Engineering||Electrical and Computer Engineering||Institute for Engineering Education and Innovation,10.1002/mrm.1910400213,9702709,,Wiley,https://scholars.library.tamu.edu/vivo/display/n133908SE
AcademicArticle,A four-channel time domain multiplexer: a cost-effective alternative to multiple receivers.,Sat Oct 01 00:00:00 UTC 1994,Magnetic Resonance in Medicine,,"Porter, Jay||Wright, Steven",Engineering Technology and Industrial Distribution||Multidisciplinary Engineering||Electrical and Computer Engineering||Institute for Engineering Education and Innovation,10.1002/mrm.1910320412,7997116,,Wiley,https://scholars.library.tamu.edu/vivo/display/n133911SE
AcademicArticle,MR flow measurement using RF phase gradients in receiver coil arrays.,Wed Dec 01 00:00:00 UTC 1993,IEEE Transactions on Biomedical Engineering,,"Porter, Jay||Wright, Steven",Engineering Technology and Industrial Distribution||Multidisciplinary Engineering||Electrical and Computer Engineering||Institute for Engineering Education and Innovation,10.1109/10.250581,8125500,,Institute of Electrical and Electronics Engineers (IEEE),https://scholars.library.tamu.edu/vivo/display/n133912SE
AcademicArticle,Random Forests Are Able to Identify Differences in Clotting Dynamics from Kinetic Models of Thrombin Generation.,Sun May 01 00:00:00 UTC 2016,PLoS ONE,,"Narayanan, Krishna||Srinivasa, Arun||Bukkapatnam, Satish",Mechanical Engineering||Energy Institute||Electrical and Computer Engineering||Industrial and Systems Engineering||Institute for Engineering Education and Innovation||Texas A&M Institute of Data Science,10.1371/journal.pone.0153776,27171403,https://hdl.handle.net/1969.1/181622,Public Library of Science (PLoS),https://scholars.library.tamu.edu/vivo/display/n139377SE
AcademicArticle,Novel 3D coaxial flow-focusing nozzle device for the production of monodispersed collagen microspheres.,Sat Aug 13 00:00:00 UTC 2016,Conference proceedings : ... Annual International Conference of the IEEE Engineering in Medicine and Biology Society. IEEE Engineering in Medicine and Biology Society. Annual Conference,,"Kameoka, Jun",Energy Institute||Electrical and Computer Engineering,10.1109/EMBC.2016.7591658,28269214,,Institute of Electrical and Electronics Engineers (IEEE),https://scholars.library.tamu.edu/vivo/display/n139739SE
AcademicArticle,"Analysis of Individual Signaling Complexes by mMAPS, a Flow-Proteometric System.",Fri Jan 01 11:11:11 UTC 2016,Current protocols in molecular biology / edited by Frederick M. Ausubel ... [et al.],,"Kameoka, Jun",Energy Institute||Electrical and Computer Engineering,10.1002/0471142727.mb2011s114,27038387,,Wiley,https://scholars.library.tamu.edu/vivo/display/n139744SE
AcademicArticle,Effect of Interstitial Fluid Pressure on Ultrasound Axial Strain and Axial Shear Strain Elastography.,Wed Mar 01 00:00:00 UTC 2017,Ultrasonic Imaging,,"Reddy, Junuthula||Righetti, Raffaella",Mechanical Engineering||Energy Institute||Electrical and Computer Engineering,10.1177/0161734616671713,27694129,,SAGE Publications,https://scholars.library.tamu.edu/vivo/display/n140179SE
AcademicArticle,Estimating conditional probabilities for the detection of unfavorable copy number alterations in a targeted therapy.,Wed Oct 30 00:00:00 UTC 2013,IEEE Transactions on Biomedical Engineering,,"Dougherty, Edward||Serpedin, Erchin",Electrical and Computer Engineering||Electrical and Computer Engineering,10.1109/TBME.2013.2266356,23744663,,Institute of Electrical and Electronics Engineers (IEEE),https://scholars.library.tamu.edu/vivo/display/n142546SE
AcademicArticle,SEQUOIA: significance enhanced network querying through context-sensitive random walk and minimization of network conductance.,Sun Jan 01 11:11:11 UTC 2017,BMC Systems Biology,,"Yoon, Byung-Jun",Electrical and Computer Engineering,10.1186/s12918-017-0404-6,,,Springer Nature,https://scholars.library.tamu.edu/vivo/display/n142936SE
AcademicArticle,Incorporating topological information for predicting robust cancer subnetwork markers in human protein-protein interaction network.,Fri Jan 01 11:11:11 UTC 2016,BMC Bioinformatics,,"Yoon, Byung-Jun",Electrical and Computer Engineering,10.1186/s12859-016-1224-1,,https://hdl.handle.net/1969.1/178741,Springer Nature,https://scholars.library.tamu.edu/vivo/display/n142938SE
AcademicArticle,Efficient experimental design for uncertainty reduction in gene regulatory networks.,Fri Dec 25 00:00:00 UTC 2015,BMC Bioinformatics,,"Dougherty, Edward||Yoon, Byung-Jun",Electrical and Computer Engineering||Electrical and Computer Engineering,10.1186/1471-2105-16-S13-S2,,https://hdl.handle.net/1969.1/179235,Springer Nature,https://scholars.library.tamu.edu/vivo/display/n143135SE
AcademicArticle,A network synthesis model for generating protein interaction network families.,Wed Aug 01 00:00:00 UTC 2012,PLoS ONE,,"Yoon, Byung-Jun",Electrical and Computer Engineering,10.1371/journal.pone.0041474,22912671,https://hdl.handle.net/1969.1/180099,Public Library of Science (PLoS),https://scholars.library.tamu.edu/vivo/display/n143149SE
AcademicArticle,RESQUE: network reduction using semi-Markov random walk scores for efficient querying of biological networks.,Wed Aug 01 00:00:00 UTC 2012,Bioinformatics,,"Yoon, Byung-Jun",Electrical and Computer Engineering,10.1093/bioinformatics/bts341,22730436,,Oxford University Press (OUP),https://scholars.library.tamu.edu/vivo/display/n143150SE
AcademicArticle,Probabilistic reconstruction of the tumor progression process in gene regulatory networks in the presence of uncertainty.,Tue Oct 18 00:00:00 UTC 2011,BMC Bioinformatics,,"Dougherty, Edward||Yoon, Byung-Jun",Electrical and Computer Engineering||Electrical and Computer Engineering,10.1186/1471-2105-12-S10-S9,,https://hdl.handle.net/1969.1/183748,Springer Nature,https://scholars.library.tamu.edu/vivo/display/n143157SE
AcademicArticle,Identification of diagnostic subnetwork markers for cancer in human protein-protein interaction network.,Fri Oct 01 00:00:00 UTC 2010,BMC Bioinformatics,,"Dougherty, Edward||Yoon, Byung-Jun",Electrical and Computer Engineering||Electrical and Computer Engineering,10.1186/1471-2105-11-S6-S8,20946619,https://hdl.handle.net/1969.1/179733,Springer Nature,https://scholars.library.tamu.edu/vivo/display/n143163SE
AcademicArticle,Accurate and reliable cancer classification based on probabilistic inference of pathway activity.,Tue Dec 01 00:00:00 UTC 2009,PLoS ONE,,"Dougherty, Edward||Yoon, Byung-Jun",Electrical and Computer Engineering||Electrical and Computer Engineering,10.1371/journal.pone.0008161,19997592,https://hdl.handle.net/1969.1/181586,Public Library of Science (PLoS),https://scholars.library.tamu.edu/vivo/display/n143166SE
AcademicArticle,Anatomical Region-Specific In Vivo Wireless Communication Channel Characterization.,Fri Sep 01 00:00:00 UTC 2017,IEEE journal of biomedical and health informatics,,"Serpedin, Erchin",Electrical and Computer Engineering,10.1109/JBHI.2016.2618890,27810839,,,https://scholars.library.tamu.edu/vivo/display/n143256SE
AcademicArticle,"The A, C, G, and T of Genome Assembly.",Fri Jan 01 00:00:00 UTC 2016,,,"Serpedin, Erchin",Electrical and Computer Engineering,10.1155/2016/6329217,27247941,https://hdl.handle.net/1969.1/181234,Hindawi,https://scholars.library.tamu.edu/vivo/display/n143257SE
AcademicArticle,Epileptic seizure onset detection based on EEG and ECG data fusion.,Sun May 01 00:00:00 UTC 2016,Epilepsy and Behavior,,"Serpedin, Erchin",Electrical and Computer Engineering,10.1016/j.yebeh.2016.02.039,27057745,,Elsevier,https://scholars.library.tamu.edu/vivo/display/n143259SE
AcademicArticle,Band-sensitive seizure onset detection via CSP-enhanced EEG features.,Tue Sep 01 00:00:00 UTC 2015,Epilepsy and Behavior,,"Serpedin, Erchin",Electrical and Computer Engineering,10.1016/j.yebeh.2015.06.002,26149062,,Elsevier,https://scholars.library.tamu.edu/vivo/display/n143260SE
AcademicArticle,Do it yourself guide to genome assembly.,Fri Jan 01 00:00:00 UTC 2016,,,"Serpedin, Erchin",Electrical and Computer Engineering,10.1093/bfgp/elu042,25392234,,Oxford University Press (OUP),https://scholars.library.tamu.edu/vivo/display/n143261SE
AcademicArticle,Reducing confounding and suppression effects in TCGA data: an integrated analysis of chemotherapy response in ovarian cancer.,Mon Oct 01 00:00:00 UTC 2012,BMC GENOMICS,,"Dougherty, Edward||Serpedin, Erchin",Electrical and Computer Engineering||Electrical and Computer Engineering,10.1186/1471-2164-13-S6-S13,23134756,https://hdl.handle.net/1969.1/183756,Springer Nature,https://scholars.library.tamu.edu/vivo/display/n143263SE
AcademicArticle,Inferring connectivity of genetic regulatory networks using information-theoretic criteria.,Tue Apr 01 00:00:00 UTC 2008,IEEE/ACM Transactions on Computational Biology and Bioinformatics,,"Dougherty, Edward||Serpedin, Erchin",Electrical and Computer Engineering||Electrical and Computer Engineering,10.1109/TCBB.2007.1067,18451435,,Institute of Electrical and Electronics Engineers (IEEE),https://scholars.library.tamu.edu/vivo/display/n143264SE
AcademicArticle,Epistasis and destabilizing mutations shape gene expression variability in humans via distinct modes of action.,Tue Nov 01 00:00:00 UTC 2016,Human Molecular Genetics,,"Tian, Yanan||Cai, James",Veterinary Integrative Biosciences||Center for Statistical Bioinformatics||Electrical and Computer Engineering||Veterinary Physiology and Pharmacology,10.1093/hmg/ddw314,28171656,,Oxford University Press (OUP),https://scholars.library.tamu.edu/vivo/display/n143269SE
AcademicArticle,Intervention in a family of Boolean networks.,Sun Jan 15 00:00:00 UTC 2006,Bioinformatics,,"Dougherty, Edward||Datta, Aniruddha",Energy Institute||Electrical and Computer Engineering||Electrical and Computer Engineering,10.1093/bioinformatics/bti765,,,Oxford University Press (OUP),https://scholars.library.tamu.edu/vivo/display/n145124SE
AcademicArticle,Classification of State Trajectories in Gene Regulatory Networks.,Mon Jan 01 00:00:00 UTC 2018,IEEE/ACM Transactions on Computational Biology and Bioinformatics,,"Dougherty, Edward||Braga Neto, Ulisses",Electrical and Computer Engineering||Electrical and Computer Engineering,10.1109/TCBB.2016.2616470,,,Institute of Electrical and Electronics Engineers (IEEE),https://scholars.library.tamu.edu/vivo/display/n145184SE
AcademicArticle,A Wearable System for Recognizing American Sign Language in Real-Time Using IMU and Surface EMG Sensors.,Thu Sep 01 00:00:00 UTC 2016,,,"Jafari, Roozbeh",Biomedical Engineering||Electrical and Computer Engineering||Computer Science and Engineering||Institute for Engineering Education and Innovation,10.1109/JBHI.2016.2598302,,,Institute of Electrical and Electronics Engineers (IEEE),https://scholars.library.tamu.edu/vivo/display/n148855SE
AcademicArticle,The low photo-inactivation rate of bacteria in human plasma II. Inhibition of methylene blue bleaching in plasma and effective bacterial destruction by the addition of dilute acetic acid to human plasma.,Thu Oct 01 00:00:00 UTC 2015,Photochemical and Photobiological Sciences,,"Rentzepis, Peter",Energy Institute||Electrical and Computer Engineering,10.1039/c5pp00042d,26222263,,Springer Nature,https://scholars.library.tamu.edu/vivo/display/n157967SE
AcademicArticle,Rationale and mechanism for the low photoinactivation rate of bacteria in plasma.,Wed Jan 01 00:00:00 UTC 2014,Proceedings of the National Academy of Sciences of the United States of America,,"Rentzepis, Peter",Energy Institute||Electrical and Computer Engineering,10.1073/pnas.1315053111,24368851,,Proceedings of the National Academy of Sciences,https://scholars.library.tamu.edu/vivo/display/n157981SE
AcademicArticle,Inactivation of bacteria in plasma.,Thu Nov 01 00:00:00 UTC 2012,Photochemical and Photobiological Sciences,,"Rentzepis, Peter",Energy Institute||Electrical and Computer Engineering,10.1039/c2pp25135c,22833174,,Springer Nature,https://scholars.library.tamu.edu/vivo/display/n157984SE
AcademicArticle,Fiber based pathogen photoinactivating system.,Sat Jan 01 00:00:00 UTC 2011,Review of Scientific Instruments,,"Rentzepis, Peter",Energy Institute||Electrical and Computer Engineering,10.1063/1.3531983,21280861,,AIP Publishing,https://scholars.library.tamu.edu/vivo/display/n157987SE
AcademicArticle,Context-dependent robustness to 5' splice site polymorphisms in human populations.,Tue Mar 01 00:00:00 UTC 2011,Human Molecular Genetics,,"Cai, James",Veterinary Integrative Biosciences||Center for Statistical Bioinformatics||Electrical and Computer Engineering,10.1093/hmg/ddq553,21224255,,Oxford University Press (OUP),https://scholars.library.tamu.edu/vivo/display/n159855SE
AcademicArticle,"Additive, epistatic, and environmental effects through the lens of expression variability QTL in a twin cohort.",Sat Feb 01 00:00:00 UTC 2014,Genetics,,"Cai, James||Brinkmeyer-Langford, Candice",Veterinary Integrative Biosciences||Veterinary Integrative Biosciences||Center for Statistical Bioinformatics||Electrical and Computer Engineering,10.1534/genetics.113.157503,24298061,,Oxford University Press (OUP),https://scholars.library.tamu.edu/vivo/display/n163095SE
AcademicArticle,Genetic variants contribute to gene expression variability in humans.,Tue Jan 01 00:00:00 UTC 2013,Genetics,,"Cai, James",Veterinary Integrative Biosciences||Center for Statistical Bioinformatics||Electrical and Computer Engineering,10.1534/genetics.112.146779,23150607,,Oxford University Press (OUP),https://scholars.library.tamu.edu/vivo/display/n163098SE
AcademicArticle,Identification of metabolic modifiers that underlie phenotypic variations in energy-balance regulation.,Tue Mar 01 00:00:00 UTC 2011,Diabetes,,"Cai, James",Veterinary Integrative Biosciences||Center for Statistical Bioinformatics||Electrical and Computer Engineering,10.2337/db10-1331,21300845,,American Diabetes Association,https://scholars.library.tamu.edu/vivo/display/n163102SE
AcademicArticle,Widespread establishment and regulatory impact of Alu exons in human genes.,Tue Feb 01 00:00:00 UTC 2011,Proceedings of the National Academy of Sciences of the United States of America,,"Cai, James",Veterinary Integrative Biosciences||Center for Statistical Bioinformatics||Electrical and Computer Engineering,10.1073/pnas.1012834108,21282640,https://hdl.handle.net/1969.1/181645,Proceedings of the National Academy of Sciences,https://scholars.library.tamu.edu/vivo/display/n163103SE
AcademicArticle,Adaptive selection of an incretin gene in Eurasian populations.,Sat Jan 01 00:00:00 UTC 2011,Genome Research,,"Cai, James",Veterinary Integrative Biosciences||Center for Statistical Bioinformatics||Electrical and Computer Engineering,10.1101/gr.110593.110,20978139,,Cold Spring Harbor Laboratory,https://scholars.library.tamu.edu/vivo/display/n163105SE
AcademicArticle,A Switched-Mode Breast Coil for 7 T MRI Using Forced-Current Excitation.,Wed Jul 01 00:00:00 UTC 2015,,,"Bosshard, John||Mcdougall, Mary||Wright, Steven",Engineering Technology and Industrial Distribution||Biomedical Engineering||Electrical and Computer Engineering,10.1109/TBME.2015.2403850,,,Institute of Electrical and Electronics Engineers (IEEE),https://scholars.library.tamu.edu/vivo/display/n166436SE
ConferencePaper,A Regularized Flow Quantification Method Using MRI Tagging and Single Echo Acquisition Imaging,Mon Dec 01 00:00:00 UTC 2008,Conference proceedings : ... Annual International Conference of the IEEE Engineering in Medicine and Biology Society. IEEE Engineering in Medicine and Biology Society. Annual Conference,,"Ji, Jim||Mcdougall, Mary||Wright, Steven",Electrical and Computer Engineering (Qatar)||Biomedical Engineering||Electrical and Computer Engineering||Electrical and Computer Engineering,10.1109/IEMBS.2008.4649935,,,Institute of Electrical and Electronics Engineers (IEEE),https://scholars.library.tamu.edu/vivo/display/n166458SE